{"text_format":"3","workbook":"xlsx","n_sheets":3,"sheets":["Bid Worksheet","UNIT CODES","RENTALS"],"not_rendered":{"defined_names":1},"read":"whole","date_system":"1900"}

{"sheet":"Bid Worksheet","index":0,"n_rows":310,"n_cols":11,"rows_kept":310}
[null,"BID #  06-19-010 ","SQ FT",null,null,"SQ FT cost",{"$f":"(H305/D1)","v":{"$error":"#DIV/0!"}}]
[null,"Bid Worksheet: Main St Bld D"]
[]
[null,"Description","Quantity","Trade Price","Unit","Labor","Unit","Total Material","Total Hours","Vendor"]
[1,"U1",67,{"v":0,"d":"$0.00"},"E",0.65,"E",{"$f":"VLOOKUP(E5,'UNIT CODES'!$A$2:$B$5,2,FALSE)*(D5)*(C5)","v":{"v":0,"d":"$0.00"}},{"$f":"VLOOKUP(G5,'UNIT CODES'!$A$2:$B$5,2,FALSE)*(F5)*(C5)","v":{"v":43.550000000000004,"d":"43.55"}}]
[2,"U2",52,{"v":0,"d":"$0.00"},"E",0.65,"E",{"$f":"VLOOKUP(E6,'UNIT CODES'!$A$2:$B$5,2,FALSE)*(D6)*(C6)","v":{"v":0,"d":"$0.00"}},{"$f":"VLOOKUP(G6,'UNIT CODES'!$A$2:$B$5,2,FALSE)*(F6)*(C6)","v":{"v":33.800000000000004,"d":"33.80"}}]
[3,"U3",21,{"v":0,"d":"$0.00"},"E",0.65,"E",{"$f":"VLOOKUP(E7,'UNIT CODES'!$A$2:$B$5,2,FALSE)*(D7)*(C7)","v":{"v":0,"d":"$0.00"}},{"$f":"VLOOKUP(G7,'UNIT CODES'!$A$2:$B$5,2,FALSE)*(F7)*(C7)","v":13.65}]
[4,"U4",102,{"v":0,"d":"$0.00"},"C",22,"C",{"$f":"VLOOKUP(E8,'UNIT CODES'!$A$2:$B$5,2,FALSE)*(D8)*(C8)","v":{"v":0,"d":"$0.00"}},{"$f":"VLOOKUP(G8,'UNIT CODES'!$A$2:$B$5,2,FALSE)*(F8)*(C8)","v":22.44}]
[5,"U5",79,{"v":0,"d":"$0.00"},"E",0.75,"E",{"$f":"VLOOKUP(E9,'UNIT CODES'!$A$2:$B$5,2,FALSE)*(D9)*(C9)","v":{"v":0,"d":"$0.00"}},{"$f":"VLOOKUP(G9,'UNIT CODES'!$A$2:$B$5,2,FALSE)*(F9)*(C9)","v":59.25}]
[6,"U6",63,{"v":0,"d":"$0.00"},"E",0.65,"E",{"$f":"VLOOKUP(E10,'UNIT CODES'!$A$2:$B$5,2,FALSE)*(D10)*(C10)","v":{"v":0,"d":"$0.00"}},{"$f":"VLOOKUP(G10,'UNIT CODES'!$A$2:$B$5,2,FALSE)*(F10)*(C10)","v":40.95}]
[7,"U7",86,{"v":0,"d":"$0.00"},"E",0.65,"E",{"$f":"VLOOKUP(E11,'UNIT CODES'!$A$2:$B$5,2,FALSE)*(D11)*(C11)","v":{"v":0,"d":"$0.00"}},{"$f":"VLOOKUP(G11,'UNIT CODES'!$A$2:$B$5,2,FALSE)*(F11)*(C11)","v":{"v":55.9,"d":"55.90"}}]
[8,"U8",78,{"v":0,"d":"$0.00"},"E",0.65,"E",{"$f":"VLOOKUP(E12,'UNIT CODES'!$A$2:$B$5,2,FALSE)*(D12)*(C12)","v":{"v":0,"d":"$0.00"}},{"$f":"VLOOKUP(G12,'UNIT CODES'!$A$2:$B$5,2,FALSE)*(F12)*(C12)","v":{"v":50.7,"d":"50.70"}}]
[9,"U9",45,{"v":0,"d":"$0.00"},"E",0.65,"E",{"$f":"VLOOKUP(E13,'UNIT CODES'!$A$2:$B$5,2,FALSE)*(D13)*(C13)","v":{"v":0,"d":"$0.00"}},{"$f":"VLOOKUP(G13,'UNIT CODES'!$A$2:$B$5,2,FALSE)*(F13)*(C13)","v":29.25}]
[10,"U11",4,{"v":0,"d":"$0.00"},"E",0.65,"E",{"$f":"VLOOKUP(E14,'UNIT CODES'!$A$2:$B$5,2,FALSE)*(D14)*(C14)","v":{"v":0,"d":"$0.00"}},{"$f":"VLOOKUP(G14,'UNIT CODES'!$A$2:$B$5,2,FALSE)*(F14)*(C14)","v":{"v":2.6,"d":"2.60"}}]
[11,"A1",95,{"v":0,"d":"$0.00"},"E",0.65,"E",{"$f":"VLOOKUP(E15,'UNIT CODES'!$A$2:$B$5,2,FALSE)*(D15)*(C15)","v":{"v":0,"d":"$0.00"}},{"$f":"VLOOKUP(G15,'UNIT CODES'!$A$2:$B$5,2,FALSE)*(F15)*(C15)","v":61.75}]
[12,"B1",44,{"v":0,"d":"$0.00"},"E",0.75,"E",{"$f":"VLOOKUP(E16,'UNIT CODES'!$A$2:$B$5,2,FALSE)*(D16)*(C16)","v":{"v":0,"d":"$0.00"}},{"$f":"VLOOKUP(G16,'UNIT CODES'!$A$2:$B$5,2,FALSE)*(F16)*(C16)","v":{"v":33,"d":"33.00"}}]
[13,"C1",16,{"v":0,"d":"$0.00"},"E",0.75,"E",{"$f":"VLOOKUP(E17,'UNIT CODES'!$A$2:$B$5,2,FALSE)*(D17)*(C17)","v":{"v":0,"d":"$0.00"}},{"$f":"VLOOKUP(G17,'UNIT CODES'!$A$2:$B$5,2,FALSE)*(F17)*(C17)","v":{"v":12,"d":"12.00"}}]
[14,"D1",46,{"v":0,"d":"$0.00"},"E",0.45,"E",{"$f":"VLOOKUP(E18,'UNIT CODES'!$A$2:$B$5,2,FALSE)*(D18)*(C18)","v":{"v":0,"d":"$0.00"}},{"$f":"VLOOKUP(G18,'UNIT CODES'!$A$2:$B$5,2,FALSE)*(F18)*(C18)","v":{"v":20.7,"d":"20.70"}}]
[15,"X1",23,{"v":90,"d":"$90.00"},"E",0.35,"E",{"$f":"VLOOKUP(E19,'UNIT CODES'!$A$2:$B$5,2,FALSE)*(D19)*(C19)","v":{"v":2070,"d":"$2,070.00"}},{"$f":"VLOOKUP(G19,'UNIT CODES'!$A$2:$B$5,2,FALSE)*(F19)*(C19)","v":{"v":8.049999999999999,"d":"8.05"}}]
[16,"Panel A",27,{"v":0,"d":"$0.00"},"E",3,"E",{"$f":"VLOOKUP(E20,'UNIT CODES'!$A$2:$B$5,2,FALSE)*(D20)*(C20)","v":{"v":0,"d":"$0.00"}},{"$f":"VLOOKUP(G20,'UNIT CODES'!$A$2:$B$5,2,FALSE)*(F20)*(C20)","v":{"v":81,"d":"81.00"}}]
[17,"Panel B",16,{"v":0,"d":"$0.00"},"E",3,"E",{"$f":"VLOOKUP(E21,'UNIT CODES'!$A$2:$B$5,2,FALSE)*(D21)*(C21)","v":{"v":0,"d":"$0.00"}},{"$f":"VLOOKUP(G21,'UNIT CODES'!$A$2:$B$5,2,FALSE)*(F21)*(C21)","v":{"v":48,"d":"48.00"}}]
[18,"Panel D",2,{"v":0,"d":"$0.00"},"E",3,"E",{"$f":"VLOOKUP(E22,'UNIT CODES'!$A$2:$B$5,2,FALSE)*(D22)*(C22)","v":{"v":0,"d":"$0.00"}},{"$f":"VLOOKUP(G22,'UNIT CODES'!$A$2:$B$5,2,FALSE)*(F22)*(C22)","v":{"v":6,"d":"6.00"}}]
[19,"Panel HP1D",1,{"v":0,"d":"$0.00"},"E",5.5,"E",{"$f":"VLOOKUP(E23,'UNIT CODES'!$A$2:$B$5,2,FALSE)*(D23)*(C23)","v":{"v":0,"d":"$0.00"}},{"$f":"VLOOKUP(G23,'UNIT CODES'!$A$2:$B$5,2,FALSE)*(F23)*(C23)","v":{"v":5.5,"d":"5.50"}}]
[20,"600A MLO",1,{"v":0,"d":"$0.00"},"E",7,"E",{"$f":"VLOOKUP(E24,'UNIT CODES'!$A$2:$B$5,2,FALSE)*(D24)*(C24)","v":{"v":0,"d":"$0.00"}},{"$f":"VLOOKUP(G24,'UNIT CODES'!$A$2:$B$5,2,FALSE)*(F24)*(C24)","v":{"v":7,"d":"7.00"}}]
[21,"MSB",1,{"v":0,"d":"$0.00"},"E",48,"E",{"$f":"VLOOKUP(E25,'UNIT CODES'!$A$2:$B$5,2,FALSE)*(D25)*(C25)","v":{"v":0,"d":"$0.00"}},{"$f":"VLOOKUP(G25,'UNIT CODES'!$A$2:$B$5,2,FALSE)*(F25)*(C25)","v":{"v":48,"d":"48.00"}}]
[22,"  1/2\" CONDUIT - EMT",{"v":3175,"d":"3,175"},{"v":40.56,"d":"$40.56"},"C",2.78,"C",{"$f":"VLOOKUP(E26,'UNIT CODES'!$A$2:$B$5,2,FALSE)*(D26)*(C26)","v":{"v":1287.78,"d":"$1,287.78"}},{"$f":"VLOOKUP(G26,'UNIT CODES'!$A$2:$B$5,2,FALSE)*(F26)*(C26)","v":{"v":88.265,"d":"88.27"}}]
[23,"  3/4\" CONDUIT - EMT",{"v":1680,"d":"1,680"},{"v":71.87,"d":"$71.87"},"C",3.2,"C",{"$f":"VLOOKUP(E27,'UNIT CODES'!$A$2:$B$5,2,FALSE)*(D27)*(C27)","v":{"v":1207.416,"d":"$1,207.42"}},{"$f":"VLOOKUP(G27,'UNIT CODES'!$A$2:$B$5,2,FALSE)*(F27)*(C27)","v":53.76}]
[24,"1\"     CONDUIT - EMT",15,{"v":123.6,"d":"$123.60"},"C",4.05,"C",{"$f":"VLOOKUP(E28,'UNIT CODES'!$A$2:$B$5,2,FALSE)*(D28)*(C28)","v":{"v":18.54,"d":"$18.54"}},{"$f":"VLOOKUP(G28,'UNIT CODES'!$A$2:$B$5,2,FALSE)*(F28)*(C28)","v":{"v":0.6075,"d":"0.61"}}]
[25,"1 1/4\" CONDUIT - EMT",40,{"v":200.62,"d":"$200.62"},"C",4.7,"C",{"$f":"VLOOKUP(E29,'UNIT CODES'!$A$2:$B$5,2,FALSE)*(D29)*(C29)","v":{"v":80.248,"d":"$80.25"}},{"$f":"VLOOKUP(G29,'UNIT CODES'!$A$2:$B$5,2,FALSE)*(F29)*(C29)","v":1.88}]
[26,"1 1/2\" CONDUIT - EMT",100,{"v":245.95,"d":"$245.95"},"C",5.92,"C",{"$f":"VLOOKUP(E30,'UNIT CODES'!$A$2:$B$5,2,FALSE)*(D30)*(C30)","v":{"v":245.95,"d":"$245.95"}},{"$f":"VLOOKUP(G30,'UNIT CODES'!$A$2:$B$5,2,FALSE)*(F30)*(C30)","v":5.92}]
[27,"2\"     CONDUIT - EMT",{"v":1540,"d":"1,540"},{"v":287.75,"d":"$287.75"},"C",6.8,"C",{"$f":"VLOOKUP(E31,'UNIT CODES'!$A$2:$B$5,2,FALSE)*(D31)*(C31)","v":{"v":4431.35,"d":"$4,431.35"}},{"$f":"VLOOKUP(G31,'UNIT CODES'!$A$2:$B$5,2,FALSE)*(F31)*(C31)","v":{"v":104.72000000000001,"d":"104.72"}}]
[28,"3 1/2\" CONDUIT - EMT",60,{"v":732.34,"d":"$732.34"},"C",11.4,"C",{"$f":"VLOOKUP(E32,'UNIT CODES'!$A$2:$B$5,2,FALSE)*(D32)*(C32)","v":{"v":439.404,"d":"$439.40"}},{"$f":"VLOOKUP(G32,'UNIT CODES'!$A$2:$B$5,2,FALSE)*(F32)*(C32)","v":6.84}]
[29,"1 1/4\" ELBOW 90 DEG - EMT",2,{"v":361.17,"d":"$361.17"},"C",30,"C",{"$f":"VLOOKUP(E33,'UNIT CODES'!$A$2:$B$5,2,FALSE)*(D33)*(C33)","v":{"v":7.223400000000001,"d":"$7.22"}},{"$f":"VLOOKUP(G33,'UNIT CODES'!$A$2:$B$5,2,FALSE)*(F33)*(C33)","v":{"v":0.6,"d":"0.60"}}]
[30,"1 1/2\" ELBOW 90 DEG - EMT",2,{"v":437.27,"d":"$437.27"},"C",40,"C",{"$f":"VLOOKUP(E34,'UNIT CODES'!$A$2:$B$5,2,FALSE)*(D34)*(C34)","v":{"v":8.7454,"d":"$8.75"}},{"$f":"VLOOKUP(G34,'UNIT CODES'!$A$2:$B$5,2,FALSE)*(F34)*(C34)","v":{"v":0.8,"d":"0.80"}}]
[31,"2\"     ELBOW 90 DEG - EMT",30,{"v":648.1,"d":"$648.10"},"C",45,"C",{"$f":"VLOOKUP(E35,'UNIT CODES'!$A$2:$B$5,2,FALSE)*(D35)*(C35)","v":{"v":194.43000000000004,"d":"$194.43"}},{"$f":"VLOOKUP(G35,'UNIT CODES'!$A$2:$B$5,2,FALSE)*(F35)*(C35)","v":{"v":13.5,"d":"13.50"}}]
[32,"3 1/2\" X 24\" RAD ELBOW 90 DEG - EMT",10,{"v":90,"d":"$90.00"},"E",70,"C",{"$f":"VLOOKUP(E36,'UNIT CODES'!$A$2:$B$5,2,FALSE)*(D36)*(C36)","v":{"v":900,"d":"$900.00"}},{"$f":"VLOOKUP(G36,'UNIT CODES'!$A$2:$B$5,2,FALSE)*(F36)*(C36)","v":{"v":7.000000000000001,"d":"7.00"}}]
[33,"  1/2\" CONN SS STL - EMT",395,{"v":18.83,"d":"$18.83"},"C",8,"C",{"$f":"VLOOKUP(E37,'UNIT CODES'!$A$2:$B$5,2,FALSE)*(D37)*(C37)","v":{"v":74.3785,"d":"$74.38"}},{"$f":"VLOOKUP(G37,'UNIT CODES'!$A$2:$B$5,2,FALSE)*(F37)*(C37)","v":{"v":31.6,"d":"31.60"}}]
[34,"  3/4\" CONN SS STL - EMT",214,{"v":31.06,"d":"$31.06"},"C",10,"C",{"$f":"VLOOKUP(E38,'UNIT CODES'!$A$2:$B$5,2,FALSE)*(D38)*(C38)","v":{"v":66.4684,"d":"$66.47"}},{"$f":"VLOOKUP(G38,'UNIT CODES'!$A$2:$B$5,2,FALSE)*(F38)*(C38)","v":{"v":21.400000000000002,"d":"21.40"}}]
[35,"1 1/4\" CONN SS STL - EMT",2,{"v":137.23,"d":"$137.23"},"C",14,"C",{"$f":"VLOOKUP(E39,'UNIT CODES'!$A$2:$B$5,2,FALSE)*(D39)*(C39)","v":{"v":2.7445999999999997,"d":"$2.74"}},{"$f":"VLOOKUP(G39,'UNIT CODES'!$A$2:$B$5,2,FALSE)*(F39)*(C39)","v":0.28}]
[36,"1 1/2\" CONN SS STL - EMT",6,{"v":197.96,"d":"$197.96"},"C",17,"C",{"$f":"VLOOKUP(E40,'UNIT CODES'!$A$2:$B$5,2,FALSE)*(D40)*(C40)","v":{"v":11.877600000000001,"d":"$11.88"}},{"$f":"VLOOKUP(G40,'UNIT CODES'!$A$2:$B$5,2,FALSE)*(F40)*(C40)","v":1.02}]
[37,"2\"     CONN SS STL - EMT",60,{"v":283.79,"d":"$283.79"},"C",20,"C",{"$f":"VLOOKUP(E41,'UNIT CODES'!$A$2:$B$5,2,FALSE)*(D41)*(C41)","v":{"v":170.27400000000003,"d":"$170.27"}},{"$f":"VLOOKUP(G41,'UNIT CODES'!$A$2:$B$5,2,FALSE)*(F41)*(C41)","v":{"v":12,"d":"12.00"}}]
[38,"  1/2\" COUPLING SS STL - EMT",310,{"v":20.16,"d":"$20.16"},"C",3.2,"C",{"$f":"VLOOKUP(E42,'UNIT CODES'!$A$2:$B$5,2,FALSE)*(D42)*(C42)","v":{"v":62.496,"d":"$62.50"}},{"$f":"VLOOKUP(G42,'UNIT CODES'!$A$2:$B$5,2,FALSE)*(F42)*(C42)","v":9.92}]
[39,"  3/4\" COUPLING SS STL - EMT",167,{"v":31.16,"d":"$31.16"},"C",4,"C",{"$f":"VLOOKUP(E43,'UNIT CODES'!$A$2:$B$5,2,FALSE)*(D43)*(C43)","v":{"v":52.0372,"d":"$52.04"}},{"$f":"VLOOKUP(G43,'UNIT CODES'!$A$2:$B$5,2,FALSE)*(F43)*(C43)","v":6.68}]
[40,"1 1/4\" COUPLING SS STL - EMT",8,{"v":160.85,"d":"$160.85"},"C",6.5,"C",{"$f":"VLOOKUP(E44,'UNIT CODES'!$A$2:$B$5,2,FALSE)*(D44)*(C44)","v":{"v":12.868,"d":"$12.87"}},{"$f":"VLOOKUP(G44,'UNIT CODES'!$A$2:$B$5,2,FALSE)*(F44)*(C44)","v":0.52}]
[41,"1 1/2\" COUPLING SS STL - EMT",14,{"v":233.44,"d":"$233.44"},"C",8,"C",{"$f":"VLOOKUP(E45,'UNIT CODES'!$A$2:$B$5,2,FALSE)*(D45)*(C45)","v":{"v":32.6816,"d":"$32.68"}},{"$f":"VLOOKUP(G45,'UNIT CODES'!$A$2:$B$5,2,FALSE)*(F45)*(C45)","v":1.12}]
[42,"2\"     COUPLING SS STL - EMT",214,{"v":312.97,"d":"$312.97"},"C",9.5,"C",{"$f":"VLOOKUP(E46,'UNIT CODES'!$A$2:$B$5,2,FALSE)*(D46)*(C46)","v":{"v":669.7558,"d":"$669.76"}},{"$f":"VLOOKUP(G46,'UNIT CODES'!$A$2:$B$5,2,FALSE)*(F46)*(C46)","v":{"v":20.330000000000002,"d":"20.33"}}]
[43,"1\"     CONN COMP STL - EMT",3,{"v":105.81,"d":"$105.81"},"C",15.6,"C",{"$f":"VLOOKUP(E47,'UNIT CODES'!$A$2:$B$5,2,FALSE)*(D47)*(C47)","v":{"v":3.1743,"d":"$3.17"}},{"$f":"VLOOKUP(G47,'UNIT CODES'!$A$2:$B$5,2,FALSE)*(F47)*(C47)","v":{"v":0.46799999999999997,"d":"0.47"}}]
[44,"3 1/2\" CONN COMP STL - EMT",10,{"v":23.01,"d":"$23.01"},"E",41.6,"C",{"$f":"VLOOKUP(E48,'UNIT CODES'!$A$2:$B$5,2,FALSE)*(D48)*(C48)","v":{"v":230.10000000000002,"d":"$230.10"}},{"$f":"VLOOKUP(G48,'UNIT CODES'!$A$2:$B$5,2,FALSE)*(F48)*(C48)","v":4.16}]
[45,"3 1/2\" COUPLING COMP STL - EMT",20,{"v":1441.37,"d":"$1,441.37"},"C",36,"C",{"$f":"VLOOKUP(E49,'UNIT CODES'!$A$2:$B$5,2,FALSE)*(D49)*(C49)","v":{"v":288.274,"d":"$288.27"}},{"$f":"VLOOKUP(G49,'UNIT CODES'!$A$2:$B$5,2,FALSE)*(F49)*(C49)","v":{"v":7.199999999999999,"d":"7.20"}}]
[46,"1 1/2\" TYPE LB STD CONDUIT BODY - EMT - ALUM",2,{"v":2192.35,"d":"$2,192.35"},"C",1,"E",{"$f":"VLOOKUP(E50,'UNIT CODES'!$A$2:$B$5,2,FALSE)*(D50)*(C50)","v":{"v":43.847,"d":"$43.85"}},{"$f":"VLOOKUP(G50,'UNIT CODES'!$A$2:$B$5,2,FALSE)*(F50)*(C50)","v":{"v":2,"d":"2.00"}}]
[47,"2\"     TYPE LB STD CONDUIT BODY - EMT - ALUM",1,{"v":2527.83,"d":"$2,527.83"},"C",1.3,"E",{"$f":"VLOOKUP(E51,'UNIT CODES'!$A$2:$B$5,2,FALSE)*(D51)*(C51)","v":{"v":25.2783,"d":"$25.28"}},{"$f":"VLOOKUP(G51,'UNIT CODES'!$A$2:$B$5,2,FALSE)*(F51)*(C51)","v":{"v":1.3,"d":"1.30"}}]
[48,"  3/4\" CONDUIT - RMC - GALV",300,{"v":193.42,"d":"$193.42"},"C",5,"C",{"$f":"VLOOKUP(E52,'UNIT CODES'!$A$2:$B$5,2,FALSE)*(D52)*(C52)","v":{"v":580.26,"d":"$580.26"}},{"$f":"VLOOKUP(G52,'UNIT CODES'!$A$2:$B$5,2,FALSE)*(F52)*(C52)","v":{"v":15,"d":"15.00"}}]
[49,"1\"     CONDUIT - RMC - GALV",18,{"v":308.22,"d":"$308.22"},"C",6.2,"C",{"$f":"VLOOKUP(E53,'UNIT CODES'!$A$2:$B$5,2,FALSE)*(D53)*(C53)","v":{"v":55.479600000000005,"d":"$55.48"}},{"$f":"VLOOKUP(G53,'UNIT CODES'!$A$2:$B$5,2,FALSE)*(F53)*(C53)","v":{"v":1.116,"d":"1.12"}}]
[50,"1 1/4\" CONDUIT - RMC - GALV",5,{"v":452.87,"d":"$452.87"},"C",7.3,"C",{"$f":"VLOOKUP(E54,'UNIT CODES'!$A$2:$B$5,2,FALSE)*(D54)*(C54)","v":{"v":22.6435,"d":"$22.64"}},{"$f":"VLOOKUP(G54,'UNIT CODES'!$A$2:$B$5,2,FALSE)*(F54)*(C54)","v":{"v":0.365,"d":"0.37"}}]
[51,"4\"     CONDUIT - RMC - GALV",45,{"v":1852.27,"d":"$1,852.27"},"C",24.5,"C",{"$f":"VLOOKUP(E55,'UNIT CODES'!$A$2:$B$5,2,FALSE)*(D55)*(C55)","v":{"v":833.5215000000001,"d":"$833.52"}},{"$f":"VLOOKUP(G55,'UNIT CODES'!$A$2:$B$5,2,FALSE)*(F55)*(C55)","v":{"v":11.025,"d":"11.03"}}]
[52,"1\"     COUPLING - RMC - GALV",12,{"v":192.78,"d":"$192.78"},"C",0,"C",{"$f":"VLOOKUP(E56,'UNIT CODES'!$A$2:$B$5,2,FALSE)*(D56)*(C56)","v":{"v":23.1336,"d":"$23.13"}},{"$f":"VLOOKUP(G56,'UNIT CODES'!$A$2:$B$5,2,FALSE)*(F56)*(C56)","v":{"v":0,"d":"0.00"}}]
[53,"4\"     COUPLING - RMC - GALV",54,{"v":2202.03,"d":"$2,202.03"},"C",0,"C",{"$f":"VLOOKUP(E57,'UNIT CODES'!$A$2:$B$5,2,FALSE)*(D57)*(C57)","v":{"v":1189.0962000000002,"d":"$1,189.10"}},{"$f":"VLOOKUP(G57,'UNIT CODES'!$A$2:$B$5,2,FALSE)*(F57)*(C57)","v":{"v":0,"d":"0.00"}}]
[54,"1\"     ELBOW 90 DEG - RMC - GALV",6,{"v":824.82,"d":"$824.82"},"C",32,"C",{"$f":"VLOOKUP(E58,'UNIT CODES'!$A$2:$B$5,2,FALSE)*(D58)*(C58)","v":{"v":49.489200000000004,"d":"$49.49"}},{"$f":"VLOOKUP(G58,'UNIT CODES'!$A$2:$B$5,2,FALSE)*(F58)*(C58)","v":1.92}]
[55,"4    x 36\" RAD ELBOW 90 DEG - RMC - GALV",18,{"v":199,"d":"$199.00"},"E",194,"C",{"$f":"VLOOKUP(E59,'UNIT CODES'!$A$2:$B$5,2,FALSE)*(D59)*(C59)","v":{"v":3582,"d":"$3,582.00"}},{"$f":"VLOOKUP(G59,'UNIT CODES'!$A$2:$B$5,2,FALSE)*(F59)*(C59)","v":34.92}]
[56,"  3/4x 6\"     NIPPLE - RMC - GALV",48,{"v":204.22,"d":"$204.22"},"C",19.5,"C",{"$f":"VLOOKUP(E60,'UNIT CODES'!$A$2:$B$5,2,FALSE)*(D60)*(C60)","v":{"v":98.02560000000001,"d":"$98.03"}},{"$f":"VLOOKUP(G60,'UNIT CODES'!$A$2:$B$5,2,FALSE)*(F60)*(C60)","v":9.36}]
[57,"  3/4x 12\"    NIPPLE - RMC - GALV",1,{"v":454.76,"d":"$454.76"},"C",19.5,"C",{"$f":"VLOOKUP(E61,'UNIT CODES'!$A$2:$B$5,2,FALSE)*(D61)*(C61)","v":{"v":4.5476,"d":"$4.55"}},{"$f":"VLOOKUP(G61,'UNIT CODES'!$A$2:$B$5,2,FALSE)*(F61)*(C61)","v":{"v":0.195,"d":"0.20"}}]
[58,"1 1/4x 6\"     NIPPLE - RMC - GALV",1,{"v":387.72,"d":"$387.72"},"C",26,"C",{"$f":"VLOOKUP(E62,'UNIT CODES'!$A$2:$B$5,2,FALSE)*(D62)*(C62)","v":{"v":3.8772,"d":"$3.88"}},{"$f":"VLOOKUP(G62,'UNIT CODES'!$A$2:$B$5,2,FALSE)*(F62)*(C62)","v":0.26}]
[59,"  3/4\" CONN THRD HUB INSUL W/ GRD LUG  MALL STG2",49,{"v":1846.61,"d":"$1,846.61"},"C",27.2,"C",{"$f":"VLOOKUP(E63,'UNIT CODES'!$A$2:$B$5,2,FALSE)*(D63)*(C63)","v":{"v":904.8389000000001,"d":"$904.84"}},{"$f":"VLOOKUP(G63,'UNIT CODES'!$A$2:$B$5,2,FALSE)*(F63)*(C63)","v":{"v":13.328000000000001,"d":"13.33"}}]
[60,"1 1/4\" CONN THRD HUB INSUL W/ GRD LUG -  MALL STG4",2,{"v":2815.65,"d":"$2,815.65"},"C",37.6,"C",{"$f":"VLOOKUP(E64,'UNIT CODES'!$A$2:$B$5,2,FALSE)*(D64)*(C64)","v":{"v":56.313,"d":"$56.31"}},{"$f":"VLOOKUP(G64,'UNIT CODES'!$A$2:$B$5,2,FALSE)*(F64)*(C64)","v":{"v":0.752,"d":"0.75"}}]
[61,"  3/4\" TYPE LB FORM 7 CONDUIT BODY W/ CVR & GSKT - RMC ",101,{"v":19.01,"d":"$19.01"},"E",0.33,"E",{"$f":"VLOOKUP(E65,'UNIT CODES'!$A$2:$B$5,2,FALSE)*(D65)*(C65)","v":{"v":1920.0100000000002,"d":"$1,920.01"}},{"$f":"VLOOKUP(G65,'UNIT CODES'!$A$2:$B$5,2,FALSE)*(F65)*(C65)","v":33.33}]
[62,"1 1/4\" TYPE LB FORM 7 CONDUIT BODY W/ CVR & GSKT - RMC",2,{"v":31.35,"d":"$31.35"},"E",0.82,"E",{"$f":"VLOOKUP(E66,'UNIT CODES'!$A$2:$B$5,2,FALSE)*(D66)*(C66)","v":{"v":62.7,"d":"$62.70"}},{"$f":"VLOOKUP(G66,'UNIT CODES'!$A$2:$B$5,2,FALSE)*(F66)*(C66)","v":1.64}]
[63,"  3/4\" TYPE T  FORM 7 CONDUIT BODY W/ CVR & GSKT - RMC ",3,{"v":19.02,"d":"$19.02"},"E",0.68,"E",{"$f":"VLOOKUP(E67,'UNIT CODES'!$A$2:$B$5,2,FALSE)*(D67)*(C67)","v":{"v":57.06,"d":"$57.06"}},{"$f":"VLOOKUP(G67,'UNIT CODES'!$A$2:$B$5,2,FALSE)*(F67)*(C67)","v":2.04}]
[64,"  3/4\" LOCKNUT - STEEL",4,{"v":21.6,"d":"$21.60"},"C",2.3,"C",{"$f":"VLOOKUP(E68,'UNIT CODES'!$A$2:$B$5,2,FALSE)*(D68)*(C68)","v":{"v":0.8640000000000001,"d":"$0.86"}},{"$f":"VLOOKUP(G68,'UNIT CODES'!$A$2:$B$5,2,FALSE)*(F68)*(C68)","v":{"v":0.092,"d":"0.09"}}]
[65,"2\"     BUSHING - PLASTIC",58,{"v":50.7,"d":"$50.70"},"C",5.8,"C",{"$f":"VLOOKUP(E69,'UNIT CODES'!$A$2:$B$5,2,FALSE)*(D69)*(C69)","v":{"v":29.406,"d":"$29.41"}},{"$f":"VLOOKUP(G69,'UNIT CODES'!$A$2:$B$5,2,FALSE)*(F69)*(C69)","v":{"v":3.364,"d":"3.36"}}]
[66,"3 1/2\" BUSHING - PLASTIC",10,{"v":147.25,"d":"$147.25"},"C",9.4,"C",{"$f":"VLOOKUP(E70,'UNIT CODES'!$A$2:$B$5,2,FALSE)*(D70)*(C70)","v":{"v":14.725,"d":"$14.73"}},{"$f":"VLOOKUP(G70,'UNIT CODES'!$A$2:$B$5,2,FALSE)*(F70)*(C70)","v":0.94}]
[67,"1\"     BUSHING GRDG INSUL 150 DEG - MALL",3,{"v":573,"d":"$573.00"},"C",3.6,"C",{"$f":"VLOOKUP(E71,'UNIT CODES'!$A$2:$B$5,2,FALSE)*(D71)*(C71)","v":{"v":17.19,"d":"$17.19"}},{"$f":"VLOOKUP(G71,'UNIT CODES'!$A$2:$B$5,2,FALSE)*(F71)*(C71)","v":{"v":0.10800000000000001,"d":"0.11"}}]
[68,"4\"     BUSHING GRDG INSUL 150 DEG - STEEL",18,{"v":2311.25,"d":"$2,311.25"},"C",15.2,"C",{"$f":"VLOOKUP(E72,'UNIT CODES'!$A$2:$B$5,2,FALSE)*(D72)*(C72)","v":{"v":416.02500000000003,"d":"$416.03"}},{"$f":"VLOOKUP(G72,'UNIT CODES'!$A$2:$B$5,2,FALSE)*(F72)*(C72)","v":{"v":2.7359999999999998,"d":"2.74"}}]
[69,"  1/2\" 1-H STRAP - RMC - STEEL",54,{"v":0.17,"d":"$0.17"},"E",4.9,"C",{"$f":"VLOOKUP(E73,'UNIT CODES'!$A$2:$B$5,2,FALSE)*(D73)*(C73)","v":{"v":9.180000000000001,"d":"$9.18"}},{"$f":"VLOOKUP(G73,'UNIT CODES'!$A$2:$B$5,2,FALSE)*(F73)*(C73)","v":{"v":2.646,"d":"2.65"}}]
[70,"  3/4\" 1-H STRAP - RMC - STEEL",336,{"v":0.26,"d":"$0.26"},"E",5.4,"C",{"$f":"VLOOKUP(E74,'UNIT CODES'!$A$2:$B$5,2,FALSE)*(D74)*(C74)","v":{"v":87.36,"d":"$87.36"}},{"$f":"VLOOKUP(G74,'UNIT CODES'!$A$2:$B$5,2,FALSE)*(F74)*(C74)","v":{"v":18.144000000000002,"d":"18.14"}}]
[71,"1 1/4\" 1-H STRAP - RMC - STEEL",7,{"v":0.84,"d":"$0.84"},"E",7,"C",{"$f":"VLOOKUP(E75,'UNIT CODES'!$A$2:$B$5,2,FALSE)*(D75)*(C75)","v":{"v":5.88,"d":"$5.88"}},{"$f":"VLOOKUP(G75,'UNIT CODES'!$A$2:$B$5,2,FALSE)*(F75)*(C75)","v":{"v":0.49000000000000005,"d":"0.49"}}]
[72,"  1/2\" 1-H STRAP - EMT - STEEL",598,{"v":12,"d":"$12.00"},"C",4.9,"C",{"$f":"VLOOKUP(E76,'UNIT CODES'!$A$2:$B$5,2,FALSE)*(D76)*(C76)","v":{"v":71.75999999999999,"d":"$71.76"}},{"$f":"VLOOKUP(G76,'UNIT CODES'!$A$2:$B$5,2,FALSE)*(F76)*(C76)","v":{"v":29.302,"d":"29.30"}}]
[73,"  3/4\" 1-H STRAP - EMT - STEEL",158,{"v":14.85,"d":"$14.85"},"C",5.4,"C",{"$f":"VLOOKUP(E77,'UNIT CODES'!$A$2:$B$5,2,FALSE)*(D77)*(C77)","v":{"v":23.462999999999997,"d":"$23.46"}},{"$f":"VLOOKUP(G77,'UNIT CODES'!$A$2:$B$5,2,FALSE)*(F77)*(C77)","v":{"v":8.532000000000002,"d":"8.53"}}]
[74,"1 1/4\" 1-H STRAP - EMT - STEEL",0,{"v":59.49,"d":"$59.49"},"C",0,"C",{"$f":"VLOOKUP(E78,'UNIT CODES'!$A$2:$B$5,2,FALSE)*(D78)*(C78)","v":{"v":0,"d":"$0.00"}},{"$f":"VLOOKUP(G78,'UNIT CODES'!$A$2:$B$5,2,FALSE)*(F78)*(C78)","v":{"v":0,"d":"0.00"}}]
[75,"1 1/2\" 1-H STRAP - EMT - STEEL",10,{"v":85.53,"d":"$85.53"},"C",7.8,"C",{"$f":"VLOOKUP(E79,'UNIT CODES'!$A$2:$B$5,2,FALSE)*(D79)*(C79)","v":{"v":8.553,"d":"$8.55"}},{"$f":"VLOOKUP(G79,'UNIT CODES'!$A$2:$B$5,2,FALSE)*(F79)*(C79)","v":0.78}]
[76,"2\"     1-H STRAP - EMT - STEEL",157,{"v":125.07,"d":"$125.07"},"C",9.2,"C",{"$f":"VLOOKUP(E80,'UNIT CODES'!$A$2:$B$5,2,FALSE)*(D80)*(C80)","v":{"v":196.35989999999998,"d":"$196.36"}},{"$f":"VLOOKUP(G80,'UNIT CODES'!$A$2:$B$5,2,FALSE)*(F80)*(C80)","v":{"v":14.443999999999999,"d":"14.44"}}]
{"$rows_left_out":231}
{"sheet":"UNIT CODES","index":1,"n_rows":4,"n_cols":2,"rows_kept":4}
["UNIT CODES","VALUES"]
["E",1]
["C",0.01]
["M",1E-3]

{"sheet":"RENTALS","index":2,"n_rows":15,"n_cols":5,"rows_kept":15}
[]
[null,"RENTALS"]
[null,null,"Daily ","Weekly","Monthly "]
[null,"Excavators",{"v":230,"d":"$230.00"},{"v":690,"d":"$690.00"},{"v":1980,"d":"$1,980.00"}]
[null,"Trencher",{"v":155,"d":"$155.00"},{"v":620,"d":"$620.00"},{"v":1740,"d":"$1,740.00"}]
[null,"Bobcat",{"v":180,"d":"$180.00"},{"v":540,"d":"$540.00"},{"v":1620,"d":"$1,620.00"}]
[null,"Auger Attachment",{"v":100,"d":"$100.00"},{"v":300,"d":"$300.00"},{"v":900,"d":"$900.00"}]
[null,"Packer",{"v":75,"d":"$75.00"},{"v":300,"d":"$300.00"},{"v":900,"d":"$900.00"}]
[null,"Slab Saw ",{"v":75,"d":"$75.00"},{"v":300,"d":"$300.00"},{"v":900,"d":"$900.00"}]
[null,"Breaker",{"v":120,"d":"$120.00"},{"v":480,"d":"$480.00"},{"v":1440,"d":"$1,440.00"}]
[null,"Core Drill",{"v":80,"d":"$80.00"},{"v":320,"d":"$320.00"}]
[null,"Sizzor Narrow",{"v":135,"d":"$135.00"},{"v":405,"d":"$405.00"},{"v":1125,"d":"$1,125.00"}]
[null,"Sizzor All Terain",{"v":250,"d":"$250.00"},{"v":750,"d":"$750.00"},{"v":2000,"d":"$2,000.00"}]
[null,"40' Manlift",{"v":250,"d":"$250.00"},{"v":750,"d":"$750.00"},{"v":2115,"d":"$2,115.00"}]
[null,"Reach Forklift",{"v":360,"d":"$360.00"},{"v":1080,"d":"$1,080.00"},{"v":3150,"d":"$3,150.00"}]